{"text_format":"1","workbook":"xlsx","n_sheets":23,"sheets":["Introduction","BridgesLCAT","Flowchart","Instructions","TechNotes","Reference","Assumptions","InitialCondition","IntvTriggers","IntvChanges","IntvCosts","IntvCost (1)","IntvCost (2)","IntvCost (3)","CorrosionRates","ElementProjection (1)","Resullts","Summary","OutputFinancial","OutputEnv","OutputOps","OutputCondition","EnvImpacts"],"not_rendered":{"charts":11,"images":29,"macros":1,"external_links":1,"defined_names":46,"comments":10,"pivot_tables":0},"unopened":[],"bounds":{"document_bytes":16777216,"sheet_cells":100000,"rows_first":2000,"rows_last":500,"rows_between":2000,"halvings":0,"cell_chars":16384,"cell_head_chars":4096},"cells_cut":0,"cells_raw":0,"read":"whole","date_system":"1900"}

{"sheet":"Introduction","index":0,"n_rows":36,"n_cols":13,"rows_kept":36,"cut":false,"hidden":false,"merged":[[14,7,32,18],[35,7,35,18]]}
[]
[]
[]
[]
[]
[]
[]
[]
{"$rows_left_out":29}
{"sheet":"BridgesLCAT","index":1,"n_rows":42,"n_cols":3,"rows_kept":42,"cut":false,"hidden":false,"merged":[[4,1,4,2]]}
[]
[]
[]
[]
[null,"Metallic Bridges Life Cycle Assessment Tool (LCAT)"]
[]
[null,1,"LCAT Definition"]
[null,"A","Each LCAT is a forecasting tool that compares different maintenance and intervention strategies for the selected asset based on a life cycle evaluation. A Life-Cycle Assessment is ‘the comparison and "]
{"$rows_left_out":35}
{"sheet":"Flowchart","index":2,"n_rows":5,"n_cols":3,"rows_kept":5,"cut":false,"hidden":false,"merged":[]}
["MAINLINE",null,"Metallic Bridges Model"]
[]
[null,"Model Flow Chart"]
[null,null,"This shows the relationship between the sheets in this model."]
[null,null,"Click on a heading to go to that sheet."]

{"sheet":"Instructions","index":3,"n_rows":45,"n_cols":4,"rows_kept":45,"cut":false,"hidden":false,"merged":[]}
["MAINLINE",null,{"$f":"Flowchart!C1","v":"Metallic Bridges Model"}]
[]
[]
[null,"Background:","MAINLINE:","Work Package 5; Deliverable 5.5 - Life-cycle Assessment Tool"]
[null,null,"File name:","ML_D5.5_BridgesModel_v09.00.xlsm"]
[null,null,"Model ref:","ML-D5.5 Bridges Model"]
[null,null,"Model version:",{"$f":"MID(CELL(\"Filename\",$A$1),FIND(\"_v\",CELL(\"Filename\",$A$1),1)+2,5)","v":"09 00"}]
[null,null,"Version date:","2014-09-01"]
{"$rows_left_out":38}
{"sheet":"TechNotes","index":4,"n_rows":45,"n_cols":4,"rows_kept":45,"cut":false,"hidden":false,"merged":[]}
["MAINLINE",{"$f":"Flowchart!C1","v":"Metallic Bridges Model"}]
[]
[null,"Amendments:","Version"]
[null,"2014-01-31","v00","Discussed with University of Surrey"]
[null,"2014-02-03","v00","Modified as follows:"]
[null,null,null,"Linear corrosion after 20 years"]
[null,null,null,"Coating loss adjusted for non-zero start."]
[null,null,null,"Coverage & exposure terms complementary"]
{"$rows_left_out":38}
{"sheet":"Reference","index":5,"n_rows":20,"n_cols":6,"rows_kept":20,"cut":false,"hidden":false,"merged":[]}
["MAINLINE",{"$f":"Flowchart!C1","v":"Metallic Bridges Model"}]
[null,"Summary of Environmental Corrosivity Categories (BS EN ISO 2012a) and Coating Systems "]
[]
[]
[null,"The standard EN ISO 9223 provides a framework for the classification of atmospheric corrosivity based on the levels of the main influencing climatic and pollutant parameters."]
[null,"The spectrum of atmospheric corrosivity is divided into five categories varying from very low corrosivity (category C1), corresponding to rural environments, up to very high corrosivity (C5) and extreme corrosivity (CX)."]
[]
[null,null,"Corrosivity category","Description ","Corrosion rates 1  (mm/year)"]
{"$rows_left_out":13}
{"sheet":"Assumptions","index":6,"n_rows":38,"n_cols":9,"rows_kept":38,"cut":false,"hidden":false,"merged":[[9,4,9,5],[10,2,10,3],[22,2,23,2],[22,3,22,5],[22,6,22,8],[21,3,21,8]]}
["MAINLINE",{"$f":"Flowchart!C1","v":"Metallic Bridges Model"}]
[null,"Summary of Element Parameters"]
[]
[]
[]
[null,null,"These tables summarise the parameters used in the projection of corrosion. These parameters have been pre-programmed in the LCAT and the user should not make any changes."]
[]
[null,null,"Table 1: Exposure conditions assumed for bridge Elements"]
{"$rows_left_out":31}
{"sheet":"InitialCondition","index":7,"n_rows":42,"n_cols":13,"rows_kept":42,"cut":false,"hidden":false,"merged":[[39,1,41,1],[24,12,24,16],[7,2,7,4],[14,1,18,1],[19,1,26,1],[29,1,37,1],[28,2,28,4],[31,3,31,4],[31,2,33,2],[13,2,13,4],[29,2,30,3]]}
["MAINLINE",null,{"$f":"Flowchart!C1","v":"Metallic Bridges Model"}]
[null,null,"Initial Condition of key Bridge Elements"]
[]
[]
[null,null,"Enter initial condition of bridge element and coating specifications"]
[null,null,"Only blue color cells may require user input"]
[]
[null,null,"Bridge Environment"]
{"$rows_left_out":35}
{"sheet":"IntvTriggers","index":8,"n_rows":43,"n_cols":121,"rows_kept":43,"cut":false,"hidden":false,"merged":[[11,4,11,9],[13,2,19,2],[13,1,19,1],[21,4,21,9],[21,1,27,1],[21,2,27,2],[19,4,19,9],[27,4,27,9],[16,4,18,7],[24,4,26,7],[14,4,15,7],[22,4,23,7],[13,4,13,9],[19,11,19,12],[27,11,27,12],[14,8,14,9],[15,8,15,9],[22,8,22,9],[23,8,23,9],[37,11,37,12],[31,1,37,1],[31,2,37,2],[31,4,31,9],[32,4,33,7],[32,8,32,9],[33,8,33,9],[34,4,36,7],[37,4,37,9]]}
["MAINLINE",null,{"$f":"Flowchart!C1","v":"Metallic Bridges Model"}]
[null,null,null,null,null,null,null,null,null,null,null,null,null,true]
[null,null,null,null,null,null,null,null,null,null,null,null,null,false]
[]
[null,"Intervention Triggers"]
[null,null,"Switch on/off and select which of the following trigger values should be applied"]
[null,null,"Enter score triggers and / or timings of interventions",null,null,null,null,null,null,null,null,null,null,null,null,null,"Intervention Timings"]
[null,null,"Fill in 'InitialCondition' sheet first, as this has an effect on these element arrangements",null,null,null,null,null,null,null,null,null,null,null,null,null,"Where interventions are triggered by user-entered timings"]
{"$rows_left_out":36}
{"sheet":"IntvChanges","index":9,"n_rows":23,"n_cols":15,"rows_kept":23,"cut":false,"hidden":false,"merged":[[8,11,9,11],[8,13,8,14],[7,7,7,14],[8,1,9,1],[8,2,9,2],[7,4,7,5],[8,9,8,10],[8,7,9,7],[8,4,9,4],[8,5,9,5]]}
["MAINLINE",null,{"$f":"Flowchart!C1","v":"Metallic Bridges Model"}]
[]
[]
[]
[null,"Intervention Changes"]
[null,null,"Enter the changes in scores due to the interventions."]
[null,null,"Only blue color cells may require user input"]
[null,null,null,null,"Coating Adjustments",null,null,"Thickness  Adjustments (Increase / Reset)"]
{"$rows_left_out":16}
{"sheet":"IntvCosts","index":10,"n_rows":22,"n_cols":23,"rows_kept":22,"cut":false,"hidden":false,"merged":[[10,3,10,7],[14,19,14,21],[10,9,10,12],[10,19,10,22],[10,14,10,17]]}
["MAINLINE",null,{"$f":"Flowchart!C1","v":"Metallic Bridges Model"}]
[null,"Intervention Costs & Impacts"]
[]
[]
[null,null,"Enter names of cost categories"]
[null,null,"Enter any budget names and proportions"]
[null,null,"Enter operational impacts of interventions"]
[null,null,"Enter discount rate and cash equivalents of impacts"]
{"$rows_left_out":15}
{"sheet":"IntvCost (1)","index":11,"n_rows":31,"n_cols":15,"rows_kept":31,"cut":false,"hidden":false,"merged":[[7,3,7,7],[7,8,7,13]]}
["MAINLINE",null,{"$f":"Flowchart!C1","v":"Metallic Bridges Model"}]
[null,"Costs & Environment Impact of Intervention"]
[null,null,"Enter costs and environmental impacts for this intervention"]
[null,"Interv. No:",{"$f":"-VALUE(RIGHT(CELL(\"filename\",A1),4))","v":1}]
[null,"Intervention:",{"$f":"IntvTriggers!C14","v":"Plating of Element (Strengthening)"}]
[null,"Scale:","ONE intervention treats:",{"$f":"100*20","v":2000},"m2"]
[]
[null,null,null,"Financial Costs Estimate   [Euros]",null,null,null,null,"Environamental Impact Assessment"]
{"$rows_left_out":24}
{"sheet":"IntvCost (2)","index":12,"n_rows":31,"n_cols":15,"rows_kept":31,"cut":false,"hidden":false,"merged":[[7,3,7,7],[7,8,7,13]]}
["MAINLINE",null,{"$f":"Flowchart!C1","v":"Metallic Bridges Model"}]
[null,"Costs & Environment Impact of Intervention"]
[null,null,"Enter costs and environmental impacts for this intervention"]
[null,"Interv. No:",{"$f":"-VALUE(RIGHT(CELL(\"filename\",A1),4))","v":2}]
[null,"Intervention:",{"$f":"IntvTriggers!C22","v":"Re-coating of Element (Painting)"}]
[null,"Scale:","ONE intervention treats:",200,"m"]
[]
[null,null,null,"Financial Costs Estimate   [Euros]",null,null,null,null,"Environamental Impact Assessment"]
{"$rows_left_out":24}
{"sheet":"IntvCost (3)","index":13,"n_rows":31,"n_cols":15,"rows_kept":31,"cut":false,"hidden":false,"merged":[[7,3,7,7],[7,8,7,13]]}
["MAINLINE",null,{"$f":"Flowchart!C1","v":"Metallic Bridges Model"}]
[null,"Costs & Environment Impact of Intervention"]
[null,null,"Enter costs and environmental impacts for this intervention"]
[null,"Interv. No:",{"$f":"-VALUE(RIGHT(CELL(\"filename\",A1),4))","v":3}]
[null,"Intervention:",{"$f":"IntvTriggers!C32","v":"Replacement of Element (on a like-for-like basis)"}]
[null,"Scale:","ONE intervention treats:",200,"m"]
[]
[null,null,null,"Financial Costs Estimate   [Euros]",null,null,null,null,"Environamental Impact Assessment"]
{"$rows_left_out":24}
{"sheet":"CorrosionRates","index":14,"n_rows":119,"n_cols":19,"rows_kept":119,"cut":false,"hidden":false,"merged":[[6,3,6,6]]}
["MAINLINE",{"$f":"Flowchart!C1","v":"Metallic Bridges Model"}]
[]
[]
[null,"Corrosion of ONE face of exposed metal"]
[null,null,"This is for one face and therefore shows half of Surrey's values"]
[null,null,null,1,2,3,4]
[null,null,null,"Cumulative thickness loss [mm]",null,null,null,null,null,null,null,"Functional formulae"]
[null,null,"Environment",{"$f":"INDEX(Assumptions!$C$25:$C$28,D$6,1)","v":"C1"},{"$f":"INDEX(Assumptions!$C$25:$C$28,E$6,1)","v":"C2"},{"$f":"INDEX(Assumptions!$C$25:$C$28,F$6,1)","v":"C3"},{"$f":"INDEX(Assumptions!$C$25:$C$28,G$6,1)","v":"C5"}]
{"$rows_left_out":112}
{"sheet":"ElementProjection (1)","index":15,"n_rows":154,"n_cols":122,"rows_kept":154,"cut":false,"hidden":false,"merged":[[22,121,24,121],[22,91,24,91],[21,27,24,27],[22,109,24,109],[22,103,22,104],[22,107,22,108],[22,105,22,106],[22,71,24,71],[23,95,23,96],[22,93,22,94],[22,95,22,97],[22,98,22,100],[22,115,24,115],[22,73,22,74],[22,70,24,70],[23,75,23,76],[131,119,131,120],[22,120,24,120],[22,75,22,77],[22,78,22,80],[22,81,22,82],[22,83,22,84],[22,85,22,86],[22,87,22,88],[22,89,24,89],[22,90,24,90],[22,117,24,117],[22,118,24,118],[22,119,24,119],[23,98,23,99],[22,114,24,114],[22,113,24,113],[21,24,21,25],[22,24,22,25],[21,49,21,51],[21,30,21,31],[21,32,21,34],[21,22,24,22],[21,23,24,23],[5,2,8,2],[22,3,22,9],[9,11,15,11],[17,2,19,2],[9,2,16,2],[22,10,22,14],[5,11,8,11],[6,4,6,8],[22,17,23,17],[28,52,30,52],[28,51,30,51],[22,66,22,67],[22,68,22,69],[22,54,22,55],[22,64,22,65],[22,62,22,63],[22,59,22,61],[22,56,22,58],[23,56,23,57],[26,51,27,51],[15,32,15,33],[21,28,24,28],[23,78,23,79],[23,59,23,60],[22,101,22,102],[21,45,21,47],[21,38,21,39],[20,41,20,43]]}
["MAINLINE",{"$f":"Flowchart!C1","v":"Metallic Bridges Model"}]
[null,"Performance projection for one Element"]
[]
[]
[null,null,"Data from input sheet",null,null,null,null,null,null,null,null,"Data derived from Inputs",null,null,null,null,null,null,"Ref","Offset",null,null,null,null,null,null,null,null,null,null,null,0]
[null,null,"Member details",{"$f":"InitialCondition!C15","v":"Element reference"},null,null,null,null,{"$f":"InitialCondition!D15","v":"Nr."},{"$f":"LEFT(RIGHT(CELL(\"filename\",D6),2),1)","v":"1"},null,"Element","Section type reference",null,null,null,null,{"$f":"SecType","v":"Channel"},{"$f":"MATCH(J8,Assumptions!$C$36:$C$38,0)","v":3},{"$f":"S6-1","v":2}]
[null,null,null,"Name:",{"$f":"OFFSET(InitialCondition!D16,0,J$6)","v":"External Main Girder"},null,null,null,null,{"$f":"OFFSET(InitialCondition!D17,0,J$6)","v":"Example"},null,null,"Exposure within structure reference",null,null,null,null,{"$f":"J9","v":"Exposed"},{"$f":"MATCH(J9,Assumptions!$E$11:$F$11,0)","v":1},{"$f":"S7-1","v":0}]
[null,null,null,{"$f":"InitialCondition!C18","v":"Element section type"},null,null,null,null,null,{"$f":"OFFSET(InitialCondition!D18,0,J$6)","v":"Channel"},null,null,"Element face1 corrosivity",null,null,null,"code",{"$f":"INDEX(Assumptions!$E$12:$F$14,InitialCondition!$E$10,S7)","v":"C5"},{"$f":"MATCH(R8,Assumptions!$C$25:$C$28,0)","v":4},3]
{"$rows_left_out":147}
{"sheet":"Resullts","index":16,"n_rows":79,"n_cols":34,"rows_kept":79,"cut":false,"hidden":false,"merged":[[50,2,50,3],[51,2,51,3],[40,3,40,4],[42,3,42,4],[43,2,43,3],[44,2,44,3],[47,3,47,4],[49,3,49,4],[10,3,10,4],[15,3,15,4],[34,3,34,4],[41,3,41,4],[48,3,48,4],[36,2,36,3],[37,2,37,3],[33,3,33,4],[35,3,35,4]]}
["MAINLINE",null,{"$f":"Flowchart!C1","v":"Metallic Bridges Model"}]
[null,null,"Summary of Projected Values"]
[null,null,null,"This sheet shows the collation of results from the Projection with additional cost and impact evaluation."]
[null,null,null,"Data from here is carried to the output sheets"]
[null,null,null,"There is no user input on this sheet."]
[]
[null,null,"Intervention schedule",null,"Years:","01-05","06-10","11-15","16-20","21-25","26-30","31-35","36-40","41-45","46-50","51-55","56-60","61-65","66-70","71-75","76-80","81-85","86-90","91-95","96-100","101-05"]
[null,null,null,null,"Period:",1,{"$f":"F8+1","v":2},3,4,5,6,7,8,9,10,11,12,13,14,15,16,17,18,19,20,21]
{"$rows_left_out":72}
{"sheet":"Summary","index":17,"n_rows":38,"n_cols":37,"rows_kept":38,"cut":false,"hidden":false,"merged":[[6,33,6,35],[6,29,6,31],[11,1,11,2],[7,4,7,24],[6,1,6,3],[6,26,6,28]]}
["MAINLINE",null,{"$f":"Flowchart!C1","v":"Metallic Bridges Model"}]
[]
[null,"Summary of Costs & Condition"]
[]
[null,null,null,"Years:",{"$f":"Resullts!F7","v":"01-05"},{"$f":"Resullts!G7","v":"06-10"},{"$f":"Resullts!H7","v":"11-15"},{"$f":"Resullts!I7","v":"16-20"},{"$f":"Resullts!J7","v":"21-25"},{"$f":"Resullts!K7","v":"26-30"},{"$f":"Resullts!L7","v":"31-35"},{"$f":"Resullts!M7","v":"36-40"},{"$f":"Resullts!N7","v":"41-45"},{"$f":"Resullts!O7","v":"46-50"},{"$f":"Resullts!P7","v":"51-55"},{"$f":"Resullts!Q7","v":"56-60"},{"$f":"Resullts!R7","v":"61-65"},{"$f":"Resullts!S7","v":"66-70"},{"$f":"Resullts!T7","v":"71-75"},{"$f":"Resullts!U7","v":"76-80"},{"$f":"Resullts!V7","v":"81-85"},{"$f":"Resullts!W7","v":"86-90"},{"$f":"Resullts!X7","v":"91-95"},{"$f":"Resullts!Y7","v":"96-100"},{"$f":"Resullts!Z7","v":"101-05"}]
[null,null,null,"Period:",{"$f":"Resullts!F8","v":1},{"$f":"Resullts!G8","v":2},{"$f":"Resullts!H8","v":3},{"$f":"Resullts!I8","v":4},{"$f":"Resullts!J8","v":5},{"$f":"Resullts!K8","v":6},{"$f":"Resullts!L8","v":7},{"$f":"Resullts!M8","v":8},{"$f":"Resullts!N8","v":9},{"$f":"Resullts!O8","v":10},{"$f":"Resullts!P8","v":11},{"$f":"Resullts!Q8","v":12},{"$f":"Resullts!R8","v":13},{"$f":"Resullts!S8","v":14},{"$f":"Resullts!T8","v":15},{"$f":"Resullts!U8","v":16},{"$f":"Resullts!V8","v":17},{"$f":"Resullts!W8","v":18},{"$f":"Resullts!X8","v":19},{"$f":"Resullts!Y8","v":20},{"$f":"Resullts!Z8","v":21}]
[null,"Interventions",null,null,null,null,null,null,null,null,null,null,null,null,null,null,null,null,null,null,null,null,null,null,null,"Financial Impacts","Environmental Impacts",null,null,"Operational Impacts",null,null,null,"Discounted costs"]
[null,"No","Name","Number","Intervention schedule",null,null,null,null,null,null,null,null,null,null,null,null,null,null,null,null,null,null,null,null,"Cash",{"$f":"IntvCosts!O14&\" \"&IntvCosts!O13","v":"kg CO2e"},{"$f":"IntvCosts!P14&\" \"&IntvCosts!P13","v":"unit2 EI-2"},{"$f":"IntvCosts!Q14&\" \"&IntvCosts!Q13","v":"unit3 EI-3"},{"$f":"IntvCosts!T13","v":"Poss(N)"},{"$f":"IntvCosts!U13","v":"Poss(D)"},{"$f":"IntvCosts!V13","v":"TSR"},null,"Financial","Env. Equivalent","Op. Equivalent"]
{"$rows_left_out":31}
{"sheet":"OutputFinancial","index":18,"n_rows":28,"n_cols":27,"rows_kept":28,"cut":false,"hidden":false,"merged":[[6,4,6,24]]}
["MAINLINE",null,{"$f":"Flowchart!C1","v":"Metallic Bridges Model"}]
[]
[null,"Summary of Projected Costs"]
[]
[null,null,null,"Years:",{"$f":"Resullts!F7","v":"01-05"},{"$f":"Resullts!G7","v":"06-10"},{"$f":"Resullts!H7","v":"11-15"},{"$f":"Resullts!I7","v":"16-20"},{"$f":"Resullts!J7","v":"21-25"},{"$f":"Resullts!K7","v":"26-30"},{"$f":"Resullts!L7","v":"31-35"},{"$f":"Resullts!M7","v":"36-40"},{"$f":"Resullts!N7","v":"41-45"},{"$f":"Resullts!O7","v":"46-50"},{"$f":"Resullts!P7","v":"51-55"},{"$f":"Resullts!Q7","v":"56-60"},{"$f":"Resullts!R7","v":"61-65"},{"$f":"Resullts!S7","v":"66-70"},{"$f":"Resullts!T7","v":"71-75"},{"$f":"Resullts!U7","v":"76-80"},{"$f":"Resullts!V7","v":"81-85"},{"$f":"Resullts!W7","v":"86-90"},{"$f":"Resullts!X7","v":"91-95"},{"$f":"Resullts!Y7","v":"96-100"},{"$f":"Resullts!Z7","v":"101-05"}]
[null,null,null,"Period:",{"$f":"Resullts!F8","v":1},{"$f":"Resullts!G8","v":2},{"$f":"Resullts!H8","v":3},{"$f":"Resullts!I8","v":4},{"$f":"Resullts!J8","v":5},{"$f":"Resullts!K8","v":6},{"$f":"Resullts!L8","v":7},{"$f":"Resullts!M8","v":8},{"$f":"Resullts!N8","v":9},{"$f":"Resullts!O8","v":10},{"$f":"Resullts!P8","v":11},{"$f":"Resullts!Q8","v":12},{"$f":"Resullts!R8","v":13},{"$f":"Resullts!S8","v":14},{"$f":"Resullts!T8","v":15},{"$f":"Resullts!U8","v":16},{"$f":"Resullts!V8","v":17},{"$f":"Resullts!W8","v":18},{"$f":"Resullts!X8","v":19},{"$f":"Resullts!Y8","v":20},{"$f":"Resullts!Z8","v":21}]
[null,"No","Name","Number","Interventions"]
[null,1,{"$f":"Resullts!D10","v":"Plating of Element (Strengthening)"},{"$f":"Resullts!AB10","v":1},{"$f":"Resullts!F10","v":0},{"$f":"Resullts!G10","v":0},{"$f":"Resullts!H10","v":0},{"$f":"Resullts!I10","v":0},{"$f":"Resullts!J10","v":0},{"$f":"Resullts!K10","v":0},{"$f":"Resullts!L10","v":0},{"$f":"Resullts!M10","v":0},{"$f":"Resullts!N10","v":0},{"$f":"Resullts!O10","v":0},{"$f":"Resullts!P10","v":0},{"$f":"Resullts!Q10","v":0},{"$f":"Resullts!R10","v":0},{"$f":"Resullts!S10","v":0},{"$f":"Resullts!T10","v":0},{"$f":"Resullts!U10","v":0},{"$f":"Resullts!V10","v":0},{"$f":"Resullts!W10","v":0},{"$f":"Resullts!X10","v":0},{"$f":"Resullts!Y10","v":0},{"$f":"Resullts!Z10","v":1}]
{"$rows_left_out":21}
{"sheet":"OutputEnv","index":19,"n_rows":25,"n_cols":27,"rows_kept":25,"cut":false,"hidden":false,"merged":[[8,4,8,24],[14,4,14,24],[20,4,20,24]]}
["MAINLINE",null,{"$f":"Flowchart!C1","v":"Metallic Bridges Model"}]
[]
[null,"Summary of Projected Environmental Impacts"]
[]
[]
[null,null,null,"Years:",{"$f":"Resullts!F7","v":"01-05"},{"$f":"Resullts!G7","v":"06-10"},{"$f":"Resullts!H7","v":"11-15"},{"$f":"Resullts!I7","v":"16-20"},{"$f":"Resullts!J7","v":"21-25"},{"$f":"Resullts!K7","v":"26-30"},{"$f":"Resullts!L7","v":"31-35"},{"$f":"Resullts!M7","v":"36-40"},{"$f":"Resullts!N7","v":"41-45"},{"$f":"Resullts!O7","v":"46-50"},{"$f":"Resullts!P7","v":"51-55"},{"$f":"Resullts!Q7","v":"56-60"},{"$f":"Resullts!R7","v":"61-65"},{"$f":"Resullts!S7","v":"66-70"},{"$f":"Resullts!T7","v":"71-75"},{"$f":"Resullts!U7","v":"76-80"},{"$f":"Resullts!V7","v":"81-85"},{"$f":"Resullts!W7","v":"86-90"},{"$f":"Resullts!X7","v":"91-95"},{"$f":"Resullts!Y7","v":"96-100"},{"$f":"Resullts!Z7","v":"101-05"}]
[null,"Environmental Impacts",null,"Period:",{"$f":"Resullts!F8","v":1},{"$f":"Resullts!G8","v":2},{"$f":"Resullts!H8","v":3},{"$f":"Resullts!I8","v":4},{"$f":"Resullts!J8","v":5},{"$f":"Resullts!K8","v":6},{"$f":"Resullts!L8","v":7},{"$f":"Resullts!M8","v":8},{"$f":"Resullts!N8","v":9},{"$f":"Resullts!O8","v":10},{"$f":"Resullts!P8","v":11},{"$f":"Resullts!Q8","v":12},{"$f":"Resullts!R8","v":13},{"$f":"Resullts!S8","v":14},{"$f":"Resullts!T8","v":15},{"$f":"Resullts!U8","v":16},{"$f":"Resullts!V8","v":17},{"$f":"Resullts!W8","v":18},{"$f":"Resullts!X8","v":19},{"$f":"Resullts!Y8","v":20},{"$f":"Resullts!Z8","v":21}]
[]
{"$rows_left_out":18}
{"sheet":"OutputOps","index":20,"n_rows":15,"n_cols":27,"rows_kept":15,"cut":false,"hidden":false,"merged":[[6,4,6,24]]}
["MAINLINE",null,{"$f":"Flowchart!C1","v":"Metallic Bridges Model"}]
[]
[null,"Summary of Projected Costs & Impacts"]
[]
[null,null,null,"Years:",{"$f":"Resullts!F7","v":"01-05"},{"$f":"Resullts!G7","v":"06-10"},{"$f":"Resullts!H7","v":"11-15"},{"$f":"Resullts!I7","v":"16-20"},{"$f":"Resullts!J7","v":"21-25"},{"$f":"Resullts!K7","v":"26-30"},{"$f":"Resullts!L7","v":"31-35"},{"$f":"Resullts!M7","v":"36-40"},{"$f":"Resullts!N7","v":"41-45"},{"$f":"Resullts!O7","v":"46-50"},{"$f":"Resullts!P7","v":"51-55"},{"$f":"Resullts!Q7","v":"56-60"},{"$f":"Resullts!R7","v":"61-65"},{"$f":"Resullts!S7","v":"66-70"},{"$f":"Resullts!T7","v":"71-75"},{"$f":"Resullts!U7","v":"76-80"},{"$f":"Resullts!V7","v":"81-85"},{"$f":"Resullts!W7","v":"86-90"},{"$f":"Resullts!X7","v":"91-95"},{"$f":"Resullts!Y7","v":"96-100"},{"$f":"Resullts!Z7","v":"101-05"}]
[null,null,null,"Period:",{"$f":"Resullts!F8","v":1},{"$f":"Resullts!G8","v":2},{"$f":"Resullts!H8","v":3},{"$f":"Resullts!I8","v":4},{"$f":"Resullts!J8","v":5},{"$f":"Resullts!K8","v":6},{"$f":"Resullts!L8","v":7},{"$f":"Resullts!M8","v":8},{"$f":"Resullts!N8","v":9},{"$f":"Resullts!O8","v":10},{"$f":"Resullts!P8","v":11},{"$f":"Resullts!Q8","v":12},{"$f":"Resullts!R8","v":13},{"$f":"Resullts!S8","v":14},{"$f":"Resullts!T8","v":15},{"$f":"Resullts!U8","v":16},{"$f":"Resullts!V8","v":17},{"$f":"Resullts!W8","v":18},{"$f":"Resullts!X8","v":19},{"$f":"Resullts!Y8","v":20},{"$f":"Resullts!Z8","v":21}]
[null,"No","Name",null,"Interventions"]
[null,1,{"$f":"Resullts!D10","v":"Plating of Element (Strengthening)"},{"$f":"Resullts!AB10","v":1},{"$f":"Resullts!F10","v":0},{"$f":"Resullts!G10","v":0},{"$f":"Resullts!H10","v":0},{"$f":"Resullts!I10","v":0},{"$f":"Resullts!J10","v":0},{"$f":"Resullts!K10","v":0},{"$f":"Resullts!L10","v":0},{"$f":"Resullts!M10","v":0},{"$f":"Resullts!N10","v":0},{"$f":"Resullts!O10","v":0},{"$f":"Resullts!P10","v":0},{"$f":"Resullts!Q10","v":0},{"$f":"Resullts!R10","v":0},{"$f":"Resullts!S10","v":0},{"$f":"Resullts!T10","v":0},{"$f":"Resullts!U10","v":0},{"$f":"Resullts!V10","v":0},{"$f":"Resullts!W10","v":0},{"$f":"Resullts!X10","v":0},{"$f":"Resullts!Y10","v":0},{"$f":"Resullts!Z10","v":1}]
{"$rows_left_out":8}
{"sheet":"OutputCondition","index":21,"n_rows":66,"n_cols":109,"rows_kept":66,"cut":false,"hidden":false,"merged":[[7,4,7,24]]}
["MAINLINE",null,{"$f":"Flowchart!C1","v":"Metallic Bridges Model"}]
[]
[null,"Summary of Projected Condition"]
[]
[null,null,null,"Years:",{"$f":"Resullts!F7","v":"01-05"},{"$f":"Resullts!G7","v":"06-10"},{"$f":"Resullts!H7","v":"11-15"},{"$f":"Resullts!I7","v":"16-20"},{"$f":"Resullts!J7","v":"21-25"},{"$f":"Resullts!K7","v":"26-30"},{"$f":"Resullts!L7","v":"31-35"},{"$f":"Resullts!M7","v":"36-40"},{"$f":"Resullts!N7","v":"41-45"},{"$f":"Resullts!O7","v":"46-50"},{"$f":"Resullts!P7","v":"51-55"},{"$f":"Resullts!Q7","v":"56-60"},{"$f":"Resullts!R7","v":"61-65"},{"$f":"Resullts!S7","v":"66-70"},{"$f":"Resullts!T7","v":"71-75"},{"$f":"Resullts!U7","v":"76-80"},{"$f":"Resullts!V7","v":"81-85"},{"$f":"Resullts!W7","v":"86-90"},{"$f":"Resullts!X7","v":"91-95"},{"$f":"Resullts!Y7","v":"96-100"},{"$f":"Resullts!Z7","v":"101-05"}]
[null,null,null,"Start yr:",0,{"$f":"E6+5","v":5},10,15,20,25,30,35,40,45,50,55,60,65,70,75,80,85,90,95,100]
[null,null,null,"Period:",{"$f":"Resullts!F8","v":1},{"$f":"Resullts!G8","v":2},{"$f":"Resullts!H8","v":3},{"$f":"Resullts!I8","v":4},{"$f":"Resullts!J8","v":5},{"$f":"Resullts!K8","v":6},{"$f":"Resullts!L8","v":7},{"$f":"Resullts!M8","v":8},{"$f":"Resullts!N8","v":9},{"$f":"Resullts!O8","v":10},{"$f":"Resullts!P8","v":11},{"$f":"Resullts!Q8","v":12},{"$f":"Resullts!R8","v":13},{"$f":"Resullts!S8","v":14},{"$f":"Resullts!T8","v":15},{"$f":"Resullts!U8","v":16},{"$f":"Resullts!V8","v":17},{"$f":"Resullts!W8","v":18},{"$f":"Resullts!X8","v":19},{"$f":"Resullts!Y8","v":20},{"$f":"Resullts!Z8","v":21}]
[null,"No","Name",null,"Interventions"]
{"$rows_left_out":59}
{"sheet":"EnvImpacts","index":22,"n_rows":52,"n_cols":12,"rows_kept":52,"cut":false,"hidden":false,"merged":[[12,1,12,4]]}
["MAINLINE",null,{"$f":"Flowchart!C1","v":"Metallic Bridges Model"}]
[null,"Environment Impact of Construction Activity"]
[null,null,"version 3"]
[null,null,"Users may amend this data and add more data if necessary"]
[]
[null,null,null,null,null,null,"NOTES: "]
[null,null,null,null,null,null,1,"These impact values will be used to build-up the environmental impact of the interventions employed in asset life-cycles."]
[null,null,null,null,null,null,2,"The data will be applicable across Europe. If it is specific to a certain country, this is noted."]
{"$rows_left_out":44}